{"text_format":"1","workbook":"xlsx","n_sheets":9,"sheets":["Instructions","InputSheetOp1","Iputsheet1Dashboard","RecordSheet1","InputSheetOp2","Inputsheet2Dashboard","Piv1","Table","RecordSheet2"],"not_rendered":{"charts":8,"images":5,"macros":1,"external_links":1,"defined_names":3,"comments":3,"pivot_tables":2},"unopened":[],"bounds":{"document_bytes":16777216,"sheet_cells":100000,"rows_first":2000,"rows_last":500,"rows_between":2000,"halvings":0,"cell_chars":16384,"cell_head_chars":4096},"cells_cut":0,"cells_raw":0,"read":"whole","date_system":"1900"}

{"sheet":"Instructions","index":0,"n_rows":0,"n_cols":0,"rows_kept":0,"cut":false,"hidden":false,"merged":[]}

{"sheet":"InputSheetOp1","index":1,"n_rows":141,"n_cols":17,"rows_kept":141,"cut":false,"hidden":false,"merged":[[93,7,93,8],[93,10,93,13],[58,1,65,1],[68,2,82,2]]}
[]
[null,null,null,"Red cells CAN'T be amended by the user"]
[null,null,null,"Orange cells CAN be amended by the user"]
[null,null,null,"Yellow cells must equal 100%"]
[null,null,"Hover your cursor over cells with a red triangle in top right corner for an explanation of its purpose"]
[]
[]
[]
[]
[]
[]
[]
[]
[]
[]
[]
[]
[null,null,null,null,null,null,null,null,null,"Forecast Years (1-5)",5]
[null,null,"STP",{"$f":"IF(AND('Piv1'!$B$2=\"(All)\",'Piv1'!$B$1=\"(All)\"),\"(All)\",'Piv1'!$M$5)","v":"NWL"},null,null," Borough population ",{"$f":"'Piv1'!$A$5","v":226344},null,"Population growth",{"$f":"(1+(('Piv1'!$J$5/'Piv1'!$A$5)^(1/5)-1))^K18-1","v":4.8122249136356876E-2},null," 1 - 5  year population",{"$f":"H19*(1+K19)","v":237236.18235851955},"Whole Borough"]
[null,null,null,null,null,null," Population override ",null,null,"Population growth override",null,null," 1 - 5  year population",{"$f":"IF(OR(K20=\"\",K20=0),(H20*(1+K19)),(H20*(1+K20)))","v":0},"Overwritten"]
[null,null,"Borough",{"$f":"'Piv1'!$B$2","v":"Hammersmith and Fulham "}]
[]
[]
[]
[]
[]
[null,null,"Option 1"]
[]
[null,null,"Activity","Activity Proportion","Consultations per person per year","% growth in consultations per person per year","Total primary care consultations 2017","Total primary care consultations in future (1-5 years)"]
[null,null,"General activity",1,5.4,2.98E-2,{"$f":"IF(H20>0,E30*H20*D30,E30*H19*D30)","v":1222257.6000000001},{"$f":"IF(N20>0,N20*E30*(1+F30)^$K$18*D30,N19*E30*(1+F30)^$K$18*D30)","v":1483676.178954103}]
{"$rows_left_out":112}
{"sheet":"Iputsheet1Dashboard","index":2,"n_rows":72,"n_cols":17,"rows_kept":72,"cut":false,"hidden":false,"merged":[]}
[]
[]
[]
[]
[]
[]
[]
[]
[]
[]
[]
[]
[]
[]
[]
[]
[]
[]
[]
[]
[]
[]
[]
[]
[]
[]
[]
[]
[]
[]
{"$rows_left_out":43}
{"sheet":"RecordSheet1","index":3,"n_rows":51,"n_cols":8,"rows_kept":51,"cut":false,"hidden":false,"merged":[[1,0,8,0],[9,0,16,0],[18,0,32,0],[36,0,50,0]]}
[null,null,"Future - Do Nothing","Scenario 1","Scenario 2","Scenario 3","Scenario 4","Scenario 5"]
["Non-Clinical","Voluntary Sector",0]
[null,"Self Care",0]
[null,"Patient Led Group",0]
[null,"Social Prescribing",0]
[null,"Care Navigation",0]
[null,"Add New",0]
[null,"Add New",0]
[null,"Add New",0]
["Consultation medium","Face to Face",0.77]
[null,"e-consultation",0]
[null,"Telephone",0.2]
[null,"Group consultation",0]
[null,"Home Visit",0.03]
[null,"Email",0]
[null,"Add New",0]
[null,"Add New",0]
[]
["Role Type","GP",0.7]
[null,"Nurse",0.27]
[null,"Consultant",0]
[null,"Pharmacist ",0]
[null,"Dietician",0]
[null,"HCA",0.03]
[null,"Psychologist",0]
[null,"Physician Associate",0]
[null,"Physiotherapist",0]
[null,"Podiatrist",0]
[null,"DSN",0]
[null,"Add New",0]
{"$rows_left_out":22}
{"sheet":"InputSheetOp2","index":4,"n_rows":142,"n_cols":19,"rows_kept":142,"cut":false,"hidden":false,"merged":[[52,5,52,12],[53,5,53,12],[57,1,64,1],[67,2,81,2]]}
[]
[null,null,null,"Red cells CAN'T be amended by the user"]
[null,null,null,"Orange cells CAN be amended by the user"]
[null,null,null,"Yellow cells must equal 100%"]
[null,null,"Hover your cursor over cells with a red triangle in top right corner for an explanation of its purpose"]
[]
[]
[]
[]
[]
[]
[]
[]
[]
[]
[]
[]
[null,null,null,null,null,null,null,null,null,"Forecast Years (1-5)",5]
[null,null,"STP",{"$f":"IF(AND('Piv1'!$B$2=\"(All)\",'Piv1'!$B$1=\"(All)\"),\"(All)\",'Piv1'!$M$5)","v":"NWL"},null,null," Borough population ",{"$f":"'Piv1'!$A$5","v":226344},null,"Population growth",{"$f":"(1+(('Piv1'!$J$5/'Piv1'!$A$5)^(1/5)-1))^K18-1","v":4.8122249136356876E-2},null," 1 - 5  year population",{"$f":"H19*(1+K19)","v":237236.18235851955}]
[null,null,null,null,null,null," Population override ",null,null,"Population growth override",null,null," 1 - 5  year population",{"$f":"IF(OR(K20=\"\",K20=0),(H20*(1+K19)),(H20*(1+K20)))","v":0}]
[null,null,"Borough",{"$f":"'Piv1'!$B$2","v":"Hammersmith and Fulham "}]
[]
[]
[]
[]
[]
[null,null,"Option 2"]
[]
[null,null,null,"Activity Proportion","Consultations per person per year","% growth in consultations per person per year","Total primary care consultations 2017","Total primary care consultations +X years"]
[null,null,null,0.12,8,2.98E-2,{"$f":"IF(H20>0,E30*H20*D30,E30*H19*D30)","v":217290.23999999999},{"$f":"IF(N20>0,N20*E30*(1+F30)^$K$18*D30,N19*E30*(1+F30)^$K$18*D30)","v":263764.65403628495}]
{"$rows_left_out":113}
{"sheet":"Inputsheet2Dashboard","index":5,"n_rows":71,"n_cols":13,"rows_kept":71,"cut":false,"hidden":false,"merged":[]}
[]
[]
[]
[]
[]
[]
[]
[]
[]
[]
[]
[]
[]
[]
[]
[]
[]
[]
[]
[]
[]
[]
[]
[]
[]
[]
[]
[]
[]
[]
{"$rows_left_out":42}
{"sheet":"Piv1","index":6,"n_rows":6,"n_cols":15,"rows_kept":6,"cut":false,"hidden":true,"merged":[]}
["STP","NWL"]
["CCG","Hammersmith and Fulham ",null,null,null,null,null,null,null,null,null,null,"CCG","Hammersmith and Fulham "]
[]
["Average of 2017Dec pop","Average of 5 year %Growth-from GPFV paper","Average of ST3 trainees in practice","Average of %staff over 55","Average of Total Staff FTE GP numbers","Average of FTE nurses","Average of Number of ST3 trainees in each CCG (correct as of July 2017)","Average of new Other Nurse joiner","Average of new Other GP joiner","Average of Population in +5yrs",null,null,"Row Labels","Average of 2017Dec pop","Average of 5 year %Growth-from GPFV paper"]
[226344,4.8122249136356654E-2,14,0.18292682926829268,124.226682305336,45.3899995684624,14,2.9983623221787474,4.9972705369645789,237236.18235851952,null,null,"NWL",226344,4.8122249136356654E-2]
[null,null,null,null,null,null,null,null,null,null,null,null,"Grand Total",226344,4.8122249136356654E-2]

{"sheet":"Table","index":7,"n_rows":82,"n_cols":48,"rows_kept":82,"cut":false,"hidden":true,"merged":[[0,23,0,24]]}
["Staff type","CCG","STP","2017Dec pop","2016 Pops","Population in +5yrs","ST3 trainees in practice","%staff over 55","Number of ST3 trainees in each CCG (correct as of July 2017)","5 year %Growth-from GPFV paper","Total Staff FTE GP numbers","new Other GP joiner","new Other Nurse joiner","FTE nurses","a","b","c","d","e","f","g","h",null,"Assumptions-Question to Paul shouldwe put these on the input sheet? Since we are making assumption here-orange/changing cells"]
["GP","Barking and Dagenham ","NEL",222517,203575.06099999999,{"$f":"D2*(1+J2)","v":236288.60825418102},5,0.38095238095238093,5,6.1890139873272743E-2,92.827595941722393,{"$f":"E2/AVERAGE($E$2:$E$33)*$Y$27","v":3.7143226970717431},{"$f":"E2/AVERAGE($E$2:$E$33)*$Y$28","v":2.2285936182430457},39.9499996751547,null,null,null,null,null,null,null,null,null,"ST3 trainees in practice",{"$f":"IF(OR(InputSheetOp1!H20=\"\",InputSheetOp1!H20=0),'Piv1'!$C$5,InputSheetOp1!H20/InputSheetOp1!H19*'Piv1'!$C$5)","v":14},null,"(takes a portion of the trainees if the population is overriden -If not overridden-use the total number of trainees for the chosen borough) The formula  =IF(OR(InputSheetOp1!H20=\"\",InputSheetOp1!H20=0),'Piv1'!$C$5,InputSheetOp1!H20/InputSheetOp1!H19*'Piv1'!$C$5)  "]
["GP","Barnet ","NCL",422435,384204.85399999999,447109.41018383129,22,0.26881720430107525,22,5.8409956996535062E-2,200.858227618039,7.0099981919560141,4.2059989151736081,77.079999193549199,null,null,null,null,null,null,null,null,null,"Total Current Staff FTE-Current GP Supply",{"$f":"InputSheetOp1!$O$96","v":124},null,"InputSheetOp1!$I$123 (picks up baseline figure which they can choose or use the figure calculated by the model)"]
["GP","Bexley ","SEL",240515,244155.81899999999,251673.8035356839,13,0.2592592592592593,13,4.6395457812127727E-2,103.097397956997,4.4547377054885926,2.6728426232931559,56.179999992251403,null,null,null,null,null,null,null,null,null,"%staff over 55",{"$f":"'Piv1'!$D$5","v":0.18292682926829268},null,"Picks the data up directly from the table on the left (through a pivot table) {'Piv1'!$D$5}"]
["GP","Brent ","NWL",377950,328675.07500000001,397717.77804492781,23,0.30569948186528495,23,5.2302627450530048E-2,187.42846643179701,5.9968312672359092,3.5980987603415455,62.329999268054998,null,null,null,null,null,null,null,null,null,"Other GP Leavers (non retirees)",{"$f":"Y3*Y7","v":9.2999999999999989},null,"Y3*Y7 {no need for further weighting as the baseline is picked up from the imput sheet which should already cater for a smaller population if the ppulatin is overriden}"]
["GP","Bromley ","SEL",348410,326803.91399999999,364036.44272228639,17,0.19444444444444442,17,4.4850729664149602E-2,169.48049418395399,5.9626910550800813,3.5776146330480492,59.579998973757,null,null,null,null,null,null,null,null,null,"Percentage over 55 retiring per year",0.18,null,"This is assumed -I think this should/could come to the input sheet as this may vary from borough to borough or from profession to profession (eg when when population is overridden)"]
["GP","Camden ","NCL",283781,238550.26800000001,293388.67898013425,38,0.15942028985507245,38,3.3855962802774808E-2,168.95774500072,4.3524617920902759,2.6114770752541654,51.549999777227598,null,null,null,null,null,null,null,null,null,"Percentage staff (GP or nurse) leaving for other reasons",7.4999999999999997E-2,null,"This is assumed -I think this should/could come to the input sheet as this may vary from borough to borough or from profession to profession (eg when when population is overridden)"]
["GP","Central London (Westminster) ","NWL",227808,314497,236549.66098850357,7,0.22471910112359553,7,3.8372932418982542E-2,101.21242835372701,5.7381456231565222,3.442887373893913,47.109999656677203,null,null,null,null,null,null,null,null,null,"Working Weeks",43,null,"could be made orange-But Paul does not want this to be changeable for now -any assumption on headcount requirement will assume GPs only work43 weeks per year"]
["GP","City and Hackney ","NEL",317246,383532.17700000003,336280.76,19,0.2099,19,0.06,189.26062592864,6.9977248838375017,4.198634930302501,52.43,null,null,null,null,null,null,null,null,null,"Hours worked per week",37.5,null,"could be made orange-But Paul does not want this to be changeable for now-any assumption on headcount requirement will assume GPs only work 37.5 hrs a weeks"]
["GP","Croydon ","SWL",410551,351025.359,430385.85726193187,23,0.27225130890052357,23,4.8312772985407149E-2,201.01133517920999,6.4046227066165873,3.8427736239699524,88.079999580979305,null,null,null,null,null,null,null,null,null,"GP NQ joining per year FTE for borough - HEE Data - Guide",{"$f":"Y2*Y25","v":9.7999999999999989},null,"not referenced/Unused -this formula/info in corporated in other formulas when used"]
["GP","Ealing ","NWL",435566,332075.69199999998,458925.67756067449,13,0.22613065326633167,13,5.36306267263158E-2,196.11204854399,6.0588771231727909,3.6353262739036749,86.889999710023403,null,null,null,null,null,null,null,null,null,"GP NQ joining per year FTE for borough - HEE Data - Guide - Amended to population scale",{"$f":"(InputSheetOp1!$H$20/GETPIVOTDATA(\"Average of 2017Dec pop\",'Piv1'!$A$4))*Y10","v":0},null,"not referenced/Unused -this formula/info in corporated in other formulas when used-not sure if correct anyway"]
["GP","Enfield ","NCL",337683,276090.13900000002,356229.93331974145,10,0.31578947368421051,10,5.4924095437855813E-2,154.985629670322,5.0373943875443192,3.0224366325265919,52.769999608397498,null,null,null,null,null,null,null,null,null,"Other new GP joiners per year FTE",{"$f":"IF(OR(InputSheetOp1!H20=\"\",InputSheetOp1!H20=0),'Piv1'!$I$5,InputSheetOp1!H20/InputSheetOp1!H19*'Piv1'!$I$5)","v":4.9972705369645789},null,"This picks the figure up from the table-average other new joiner per borough is 25 for GPs (and 20 for Nurses) -this then gets apportioned for over-riden population"]
["GP","Greenwich ","SEL",295364,183221.777,313482.27913923428,13,0.328125,13,6.1342205344030676E-2,135.98965106532,3.3429674615640543,2.0057804769384324,59.1199995167553,null,null,null,null,null,null,null,null,null,"CurrentGPCapacity-Baseline",{"$f":"InputSheetOp1!$N$96","v":124},"Stewart just amended these 1May at 14.39pm","(duplicated from Y2) InputSheetOp1!$I$123 (picks up baseline figure which they can choose or use the figure calculated by the model)"]
["GP","Hammersmith and Fulham ","NWL",226344,273891.02600000001,237236.18235851952,14,0.18292682926829268,14,4.8122249136356654E-2,124.226682305336,4.9972705369645789,2.9983623221787474,45.3899995684624,null,null,null,null,null,null,null,null,null,"GP Supply in Year +1",{"$f":"Y13+Z14","v":125.41434370769629},{"$f":"(($Y$2*$Y$25)+Y$12-Y$5)-($Y$13*$Y$4*$Y$6)","v":1.414343707696287},"Stewart said this formula should be [(($Y$2*$Y$21)+Y$12-Y$5)]-however I think it is incorrect as the retirees should also be accounted for-SO-So these supply figures are calculated as; [Trainee count (apportioned if population is overridden) ] multiplied by the [trainee retention rate] PLUS [other joiners (apportioned if population is overridden)] MINUS [other leavers (apportioned if population is overridden)] MINUS [retirees (current/baseline staff multiplied by %staff over 55 multiplied by Percentage over 55 retiring per year]"]
["GP","Haringey ","NCL",316492,252971.07,331888.76679495152,12,0.31818181818181818,12,4.8648202150296083E-2,144.08626034483299,4.6155761044007484,2.7693456626404491,62.149998918175697,null,null,null,null,null,null,null,null,null,"GP Supply in Year +2",{"$f":"Y14+Z14","v":126.82868741539258},{"$f":"(($Y$2*$Y$25)+Y$12-Y$5)-($Y$13*$Y$4*$Y$6)","v":1.414343707696287},"Stewart said this formula should be [(($Y$2*$Y$21)+Y$12-Y$5)]-however I think it is incorrect as the retirees should also be accounted for-SO-So these supply figures are calculated as; [Trainee count (apportioned if population is overridden) ] multiplied by the [trainee retention rate] PLUS [other joiners (apportioned if population is overridden)] MINUS [other leavers (apportioned if population is overridden)] MINUS [retirees (current/baseline staff multiplied by %staff over 55 multiplied by Percentage over 55 retiring per year]"]
["GP","Harrow ","NWL",265538,250935.008,282312.70148877497,15,0.24427480916030536,15,6.317250822396403E-2,136.272930063307,4.5784271959730836,2.7470563175838505,55.529999990016201,null,null,null,null,null,null,null,null,null,"GP Supply in Year +3",{"$f":"Y15+Z15","v":128.24303112308885},1.414343707696287,"Stewart said this formula should be [(($Y$2*$Y$21)+Y$12-Y$5)]-however I think it is incorrect as the retirees should also be accounted for-SO-So these supply figures are calculated as; [Trainee count (apportioned if population is overridden) ] multiplied by the [trainee retention rate] PLUS [other joiners (apportioned if population is overridden)] MINUS [other leavers (apportioned if population is overridden)] MINUS [retirees (current/baseline staff multiplied by %staff over 55 multiplied by Percentage over 55 retiring per year]"]
["GP","Havering ","NEL",277244,298900.85499999998,291885.55530405702,12,0.39215686274509809,12,5.2811080867600557E-2,142.588130421937,5.4535866252332843,3.2721519751399706,61.839999616146102,null,null,null,null,null,null,null,null,null,"GP Supply in Year +4",129.65737483078513,1.414343707696287,"Stewart said this formula should be [(($Y$2*$Y$21)+Y$12-Y$5)]-however I think it is incorrect as the retirees should also be accounted for-SO-So these supply figures are calculated as; [Trainee count (apportioned if population is overridden) ] multiplied by the [trainee retention rate] PLUS [other joiners (apportioned if population is overridden)] MINUS [other leavers (apportioned if population is overridden)] MINUS [retirees (current/baseline staff multiplied by %staff over 55 multiplied by Percentage over 55 retiring per year]"]
["GP","Hillingdon ","NWL",311828,271874.32400000002,327549.57686348545,12,0.28571428571428575,12,5.0417463677044472E-2,128.14292012155099,4.9604748608388576,2.9762849165033147,57.479999758303201,null,null,null,null,null,null,null,null,null,"GP Supply in Year +5",131.07171853848141,{"$f":"(($Y$2*$Y$25)+Y$12-Y$5)-($Y$13*$Y$4*$Y$6)","v":1.414343707696287},"Stewart said this formula should be [(($Y$2*$Y$21)+Y$12-Y$5)]-however I think it is incorrect as the retirees should also be accounted for-SO-So these supply figures are calculated as; [Trainee count (apportioned if population is overridden) ] multiplied by the [trainee retention rate] PLUS [other joiners (apportioned if population is overridden)] MINUS [other leavers (apportioned if population is overridden)] MINUS [retirees (current/baseline staff multiplied by %staff over 55 multiplied by Percentage over 55 retiring per year]"]
["GP","Hounslow ","NWL",313844,222886.848,330788.78762000339,8,0.31683168316831684,8,5.3991115394920408E-2,163.37255097180599,4.0666753301632541,2.4400051980979525,65.019998859614105,null,null,null,null,null,null,null,null,null,"Total Current Staff FTE-Current NURSE Supply",{"$f":"InputSheetOp1!$O$97","v":45}]
["GP","Islington ","NCL",251474,159617.11499999999,259115.49683060707,11,0.18548387096774191,11,3.0386826592836869E-2,141.335729807615,2.9122893058379606,1.7473735835027764,47.6899997889996,null,null,null,null,null,null,null,null,null,"Nurse Other Joiners ",{"$f":"IF(OR(InputSheetOp1!H20=\"\",InputSheetOp1!H20=0),'Piv1'!$H$5,InputSheetOp1!H20/InputSheetOp1!H19*'Piv1'!$H$5)","v":2.9983623221787474},null,"This picks the figure up from the table-average other new joiner per borough is 20 for Nurses (25 for GPs) -this then gets apportioned for over-riden population"]
["GP","Kingston ","SWL",209112,173060.85800000001,218336.8855576574,6,0.19626168224299065,6,4.4114568067147752E-2,111.845867834985,3.1575767173372475,1.8945460304023487,45.169999822974198,null,null,null,null,null,null,null,null,null,"Nurse Other Leavers",{"$f":"Y19*Y7","v":3.375},null,"Y19*Y7  {no need for further weighting as the baseline is picked up from the imput sheet which should already cater for a smaller population if the ppulatin is overriden}"]
["GP","Lambeth ","SEL",410340,324131.00300000003,427262.11452170153,24,0.15217391304347827,24,4.1239251649124009E-2,220.178523242474,5.9139225372381414,3.5483535223428846,74.160000070929499,null,null,null,null,null,null,null,null,null,"Nurse Supply (constant every year)",{"$f":"Y20-Y21","v":-0.37663767782125257}]
["GP","Lewisham ","SEL",329022,298744.56400000001,346865.50987591525,16,0.28089887640449435,16,5.4231965874364851E-2,162.433233961463,5.4507350224593667,3.2704410134756197,66.3899996727705,null,null,null,null,null,null,null,null,null,"BaselineNursePopulation",9,null,"not yet used/referenced for any purpose but it was on the original model`s data back sheet"]
["GP","Merton ","SWL",226428,207868.00099999999,237529.19613498377,12,0.16800000000000001,12,4.9027488362674898E-2,111.531075768173,3.7926494056618836,2.2755896433971303,47.239999756217003,null,null,null,null,null,null,null,null,null,"BaselineHCAPopulation",2,null,"not yet used/referenced for any purpose but it was on the original model`s data back sheet"]
["GP","Newham ","NEL",398140,332321.07699999999,419447.02466542617,11,0.32317073170731708,11,5.351641298394072E-2,173.27943336218601,6.0633542878635138,3.6380125727181083,74.259999111294704,null,null,null,null,null,null,null,null,null,"TraineeRetentionRate",0.7,null,"Paul said may come to the front at some stage - as this may vary from borough to borough or from profession to profession (eg when when population is overridden)"]
["GP","Redbridge ","NEL",318732,302081.81300000002,341380.8947809512,19,0.29268292682926833,19,7.1059368939896839E-2,132.56116823107001,5.5116246994443099,3.3069748196665856,47.7199996039271,null,null,null,null,null,null,null,null,null,"Admin Apportioning",8,null,"Referenced/Used in cell H112 on both input sheets (1/X of the time is spent on admin)-not sure why this info was put on the face of the input sheet though-not used in any other further calculations beside H112 (H112 is not refernced or used further elsewhere). Also non clinical time has already be taken out -so not sure why additional admin time should be shown...I just find the logic strange"]
["GP","Richmond ","SWL",216808,198405.514,228657.89872767348,19,0.22608695652173913,19,5.4656187629946729E-2,115.68869536370001,3.6200018816370907,2.1720011289822541,35.689999848604202,null,null,null,null,null,null,null,null,null,"Average new GP joiner per borough",5,null,"Average new GP joiner per borough AND Average new Nurse joiner per borough are assumed figures and these numbers are picked up by the main table columns L and M-it is weighed across boroughs"]
["GP","Southwark ","SEL",328996,308188.76,343362.01577627944,15,0.2013888888888889,15,4.366623234409972E-2,160.489265888929,5.6230488185897984,3.3738292911538794,70.049999654293103,null,null,null,null,null,null,null,null,null,"Average new Nurse joiner per borough",3,"Op2"]
["GP","Sutton ","SWL",194371,201880.88,203788.67101144005,17,0.25225225225225228,17,4.8452037657058078E-2,95.844801142811804,3.6834115682215951,2.2100469409329571,40.939999908208797,null,null,null,null,null,null,null,null,null,"Overriden Population 5yr growth-assume constant rate",{"$f":"IF(OR(InputSheetOp1!K20=0,InputSheetOp1!K20=\"\",InputSheetOp1!K20=\"-\"),InputSheetOp1!K19,InputSheetOp1!K20)","v":4.8122249136356876E-2},{"$f":"IF(OR(InputSheetOp2!K20=0,InputSheetOp2!K20=\"\",InputSheetOp2!K20=\"-\"),InputSheetOp2!K19,InputSheetOp2!K20)","v":4.8122249136356876E-2},"This number comes from the input sheet(s) (K19 and K20)-if the growth percentage cell for the overridden population growth rate is left blank then use the borough population growth rate WHEN POPULATION IS OVERRIDDEN IT WAS SAID IT HAS TO BE A CONSTANT ASSUMED GROWTH RATE-NOT THE BOROUGH POPULATION GROWTH"]
["GP","Tower Hamlets ","NEL",321811,290632.35800000001,338399.9317942154,15,0.17391304347826086,15,5.1548678554230287E-2,184.851203102618,5.3027240101029882,3.1816344060617929,77.329999990761294,null,null,null,null,null,null,null,null,null,"Appointments per person",6.46,null,"not yet used/referenced for any purpose but it was on the original model`s data back sheet"]
{"$rows_left_out":53}
{"sheet":"RecordSheet2","index":8,"n_rows":189,"n_cols":23,"rows_kept":189,"cut":false,"hidden":false,"merged":[]}
[]
[null,null,null,"Future Do Nothing","Scenario 1","Scenario 2","Scenario 3","Scenario 4","Scenario 5","Scenario 6","Scenario 7","Scenario 8","Scenario 9"]
[null,"Non-Clinical"]
[null,"Voluntary Sector",null,0,0,0,0,0,0,null,null,0]
[null,"Self Care",null,0.5,0.5,0,0,0.5,0,null,null,0.5]
[null,"Patient Led Group",null,0,0,0,0,0,0,null,null,0]
[null,"Social Prescribing",null,0,0,0,0,0,0,null,null,0]
[null,"Care Navigation",null,0,0,0,0,0,0,null,null,0]
[null,"Add New",null,0,0,0,0,0,0,null,null,0]
[null,"Add New",null,0,0,0,0,0,0,null,null,0]
[null,"Add New",null,0,0,0,0,0,0,null,null,0]
[null,"Clinical Time per consultation(mins);"]
[null,"Face to Face",null,10,10,10,10,10,10,null,null,10]
[null,"e-consultation",null,10,10,10,10,10,10,null,null,10]
[null,"Telephone",null,5,5,5,5,5,5,null,null,5]
[null,"Group consultation",null,10,10,10,10,10,10,null,null,10]
[null,"Home Visit",null,20,20,20,20,20,20,null,null,20]
[null,"Email",null,5,5,5,5,5,5,null,null,5]
[null,"Add New",null,5,5,5,5,5,5,null,null,5]
[null,"Add New",null,0,0,0,0,0,0,null,null,0]
[]
[]
[]
[null,"Roles"]
[null,"GP",null,12.867146415709332,6.4316773090156998,10.857776045186561,20.358330084724802,6.4316773090156998,26.056064090765368,null,null,6.4316773090156998]
[null,"Nurse",null,14.323804500506615,7.1654928409168193,12.096582708060197,22.681092577612866,7.1654928409168193,22.681092577612866,null,null,7.1654928409168193]
[null,"Consultant",null,0,0,0,0,0,0,null,null,0]
[null,"Pharmacist ",null,0.24277634746621382,0.14230424018767679,0.2402340005572659,0.45043875104487358,0.14230424018767679,0.45043875104487358,null,null,0.14230424018767679]
[null,"Dietician",null,0,0,0,0,0,0,null,null,0]
[null,"HCA",null,2.4277634746621382,1.2398635395075246,2.0931026218766045,3.9245674160186321,1.2398635395075246,3.9245674160186321,null,null,1.2398635395075246]
{"$rows_left_out":159}