{"text_format":"1","workbook":"xlsx","n_sheets":4,"sheets":["Introduction to the Tool","Input sheet ","Appendix","Data back sheet "],"not_rendered":{"charts":3,"images":2,"macros":1,"external_links":0,"defined_names":7,"comments":0,"pivot_tables":0},"unopened":[],"bounds":{"document_bytes":16777216,"sheet_cells":100000,"rows_first":2000,"rows_last":500,"rows_between":2000,"halvings":0,"cell_chars":16384,"cell_head_chars":4096},"cells_cut":0,"cells_raw":0,"read":"whole","date_system":"1900"}

{"sheet":"Introduction to the Tool","index":0,"n_rows":0,"n_cols":0,"rows_kept":0,"cut":false,"hidden":false,"merged":[]}

{"sheet":"Input sheet ","index":1,"n_rows":75,"n_cols":13,"rows_kept":75,"cut":false,"hidden":false,"merged":[[70,1,70,4],[72,1,72,4],[74,1,74,4],[35,1,35,4],[33,1,33,4],[29,1,29,4],[31,1,31,4],[48,1,48,4],[68,15,68,17],[37,0,40,5],[41,9,43,9],[50,15,50,17],[56,0,59,5],[60,9,62,9],[50,1,50,4],[52,1,52,4],[54,1,54,4],[68,1,68,4],[28,15,28,17],[10,23,16,23],[22,9,24,9],[7,0,9,5],[18,0,21,5]]}
[]
[]
[]
[]
[]
[]
[]
["Workforce information"]
[]
[null,null,null,null,null,null,null,null,null,null,null,"Proportional split of contacts  between  staff types"]
[null,null,null,null,null,null,"STP area","SWL",null,null,null,"GP",0.7]
[null,null,null,null,null,null,null,null,null,null,null,"Nurse",0.2]
[null,null,null,null,null,null,null,null,null,null,null,"Other",0.1]
[null,null,null,null,null,null,"CCG","Merton"]
[]
{"$rows_left_out":61}
{"sheet":"Appendix","index":2,"n_rows":0,"n_cols":0,"rows_kept":0,"cut":false,"hidden":false,"merged":[]}

{"sheet":"Data back sheet ","index":3,"n_rows":109,"n_cols":40,"rows_kept":109,"cut":false,"hidden":false,"merged":[[0,18,0,23],[0,24,0,29]]}
[null,null,null,null,null,null,null,null,null,null,null,null,null,null,null,null,null,null,"Supply",null,null,null,null,null,"Demand"]
["Staff type","CCG","STP","2016 pop","2021 pop","Annual % increase","Total Staff FTE","ST1 joiners","%staff over 55","%over 55 retiring","%leavers","face to face appt time (mins)","Telephone appt time","home visit appt time","days worked per year","hours per day","appts per person","%change in apps per year",2016,2017,2018,2019,2020,2021,2016,2017,2018,2019,2020,2021,null,"2016 appts","2021 appts",null,2016,2017,2018,2019,2020,2021]
["GP","Barking & Dagenham","NEL",205773.00919779594,222143.38148233082,{"$f":"(1+(E3-D3)/D3)^0.2","v":1.015427670862397},84.199999958276706,2,0.38095238095238093,0.17499999999999999,0.06,12.5,10,45,200,10.5,5.5,1.7000000000000001E-2,{"$f":"G3","v":84.199999958276706},{"$f":"S3+'Input sheet '!$F$36+($H3*0.8)-(S3*$I3*'Input sheet '!$F$32)-(S3*'Input sheet '!$F$34)","v":80.13466663022831},{"$f":"T3+'Input sheet '!$F$36+($H3*0.8)-(T3*$I3*'Input sheet '!$F$32)-(T3*'Input sheet '!$F$34)","v":76.584275523732728},{"$f":"U3+'Input sheet '!$F$36+($H3*0.8)-(U3*$I3*'Input sheet '!$F$32)-(U3*'Input sheet '!$F$34)","v":73.483600624059918},{"$f":"V3+'Input sheet '!$F$36+($H3*0.8)-(V3*$I3*'Input sheet '!$F$32)-(V3*'Input sheet '!$F$34)","v":70.775677878345661},{"$f":"W3+'Input sheet '!$F$36+($H3*0.8)-(W3*$I3*'Input sheet '!$F$32)-(W3*'Input sheet '!$F$34)","v":68.410758680421878},{"$f":"(($Q3*$D3*'Input sheet '!$C$25*'Input sheet '!$D$25*'Input sheet '!$M$11)+($Q3*$D3*'Input sheet '!$C$26*'Input sheet '!$D$26*'Input sheet '!$M$11)+($Q3*$D3*'Input sheet '!$C$27*'Input sheet '!$D$27*'Input sheet '!$M$11))/($O3*$P3*60*(1-'Input sheet '!$F$30))","v":117.21712488231589},{"$f":"Y3*(F3+R3)","v":121.0182032274361},{"$f":"Z3*(F3+R3)","v":124.94254169005407},{"$f":"AA3*(F3+R3)","v":128.99413730869045},{"$f":"AB3*(F3+R3)","v":133.1771167365155},{"$f":"AC3*(F3+R3)","v":137.49574044445023},null,{"$f":"Q3*D3","v":1131751.5505878776},{"$f":"E3*(Q3*(1+R3)^5)","v":1329232.13647809},"GP Supply",{"$f":"IF('Input sheet '!$H$14=\"All\",SUMIF('Data back sheet '!$C3:$C34,'Input sheet '!$H$11,'Data back sheet '!S3:S34),VLOOKUP('Input sheet '!$H$14,'Data back sheet '!$B$2:$AD$34,18,FALSE))","v":106.75000031665},{"$f":"IF('Input sheet '!$H$14=\"All\",SUMIF('Data back sheet '!$C3:$C34,'Input sheet '!$H$11,'Data back sheet '!T3:T34),VLOOKUP('Input sheet '!$H$14,'Data back sheet '!$B$2:$AD$34,19,FALSE))","v":104.6065502883415},{"$f":"IF('Input sheet '!$H$14=\"All\",SUMIF('Data back sheet '!$C3:$C34,'Input sheet '!$H$11,'Data back sheet '!U3:U34),VLOOKUP('Input sheet '!$H$14,'Data back sheet '!$B$2:$AD$34,20,FALSE))","v":102.65472469256378},{"$f":"IF('Input sheet '!$H$14=\"All\",SUMIF('Data back sheet '!$C3:$C34,'Input sheet '!$H$11,'Data back sheet '!V3:V34),VLOOKUP('Input sheet '!$H$14,'Data back sheet '!$B$2:$AD$34,21,FALSE))","v":100.87739230504857},{"$f":"IF('Input sheet '!$H$14=\"All\",SUMIF('Data back sheet '!$C3:$C34,'Input sheet '!$H$11,'Data back sheet '!W3:W34),VLOOKUP('Input sheet '!$H$14,'Data back sheet '!$B$2:$AD$34,22,FALSE))","v":99.258953432977236},{"$f":"IF('Input sheet '!$H$14=\"All\",SUMIF('Data back sheet '!$C3:$C34,'Input sheet '!$H$11,'Data back sheet '!X3:X34),VLOOKUP('Input sheet '!$H$14,'Data back sheet '!$B$2:$AD$34,23,FALSE))","v":97.785202996069088}]
["GP","Barnet","NCL",385107.65722786763,409895.37418397202,{"$f":"(1+(E4-D4)/D4)^0.2","v":1.0125539510542096},202.27000023052099,12,0.26881720430107525,0.17499999999999999,0.06,12.5,10,45,200,10.5,5.5,1.7000000000000001E-2,{"$f":"G4","v":202.27000023052099},{"$f":"S4+'Input sheet '!$F$36+($H4*0.8)-(S4*$I4*'Input sheet '!$F$32)-(S4*'Input sheet '!$F$34)","v":195.21841042089909},{"$f":"T4+'Input sheet '!$F$36+($H4*0.8)-(T4*$I4*'Input sheet '!$F$32)-(T4*'Input sheet '!$F$34)","v":188.92164401509208},{"$f":"U4+'Input sheet '!$F$36+($H4*0.8)-(U4*$I4*'Input sheet '!$F$32)-(U4*'Input sheet '!$F$34)","v":183.29890244336903},{"$f":"V4+'Input sheet '!$F$36+($H4*0.8)-(V4*$I4*'Input sheet '!$F$32)-(V4*'Input sheet '!$F$34)","v":178.27803605816752},{"$f":"W4+'Input sheet '!$F$36+($H4*0.8)-(W4*$I4*'Input sheet '!$F$32)-(W4*'Input sheet '!$F$34)","v":173.79461832742496},{"$f":"(($Q4*$D4*'Input sheet '!$C$25*'Input sheet '!$D$25*'Input sheet '!$M$11)+($Q4*$D4*'Input sheet '!$C$26*'Input sheet '!$D$26*'Input sheet '!$M$11)+($Q4*$D4*'Input sheet '!$C$27*'Input sheet '!$D$27*'Input sheet '!$M$11))/($O4*$P4*60*(1-'Input sheet '!$F$30))","v":219.37382617087459},225.85718949210329,232.53216181559424,239.40440594442185,246.47975203986542,253.76420256750529,null,{"$f":"Q4*D4","v":2118092.1147532719},{"$f":"E4*(Q4*(1+R4)^5)","v":2452677.636953969},"GP Demand",{"$f":"IF('Input sheet '!$H$14=\"All\",SUMIF('Data back sheet '!$C3:$C34,'Input sheet '!$H$11,'Data back sheet '!Y3:Y34),VLOOKUP('Input sheet '!$H$14,'Data back sheet '!$B$2:$AD$34,24,FALSE))","v":117.99620303858993},{"$f":"IF('Input sheet '!$H$14=\"All\",SUMIF('Data back sheet '!$C3:$C34,'Input sheet '!$H$11,'Data back sheet '!Z3:Z34),VLOOKUP('Input sheet '!$H$14,'Data back sheet '!$B$2:$AD$34,25,FALSE))","v":120.57131912117622},{"$f":"IF('Input sheet '!$H$14=\"All\",SUMIF('Data back sheet '!$C3:$C34,'Input sheet '!$H$11,'Data back sheet '!AA3:AA34),VLOOKUP('Input sheet '!$H$14,'Data back sheet '!$B$2:$AD$34,26,FALSE))","v":123.20263381581975},{"$f":"IF('Input sheet '!$H$14=\"All\",SUMIF('Data back sheet '!$C3:$C34,'Input sheet '!$H$11,'Data back sheet '!AB3:AB34),VLOOKUP('Input sheet '!$H$14,'Data back sheet '!$B$2:$AD$34,27,FALSE))","v":125.89137358528799},{"$f":"IF('Input sheet '!$H$14=\"All\",SUMIF('Data back sheet '!$C3:$C34,'Input sheet '!$H$11,'Data back sheet '!AC3:AC34),VLOOKUP('Input sheet '!$H$14,'Data back sheet '!$B$2:$AD$34,28,FALSE))","v":128.63879165832827},{"$f":"IF('Input sheet '!$H$14=\"All\",SUMIF('Data back sheet '!$C3:$C34,'Input sheet '!$H$11,'Data back sheet '!AD3:AD34),VLOOKUP('Input sheet '!$H$14,'Data back sheet '!$B$2:$AD$34,29,FALSE))","v":131.44616861380109}]
["GP","Bexley","SEL",243302.5946654997,248378.10743593232,1.0041377966701761,102.030000910163,1,0.2592592592592593,0.17499999999999999,0.06,12.5,10,45,200,10.5,5.5,1.7000000000000001E-2,102.030000910163,{"$f":"S5+'Input sheet '!$F$36+($H5*0.8)-(S5*$I5*'Input sheet '!$F$32)-(S5*'Input sheet '!$F$34)","v":97.079061925369899},{"$f":"T5+'Input sheet '!$F$36+($H5*0.8)-(T5*$I5*'Input sheet '!$F$32)-(T5*'Input sheet '!$F$34)","v":92.64980521508555},{"$f":"U5+'Input sheet '!$F$36+($H5*0.8)-(U5*$I5*'Input sheet '!$F$32)-(U5*'Input sheet '!$F$34)","v":88.687260924829317},{"$f":"V5+'Input sheet '!$F$36+($H5*0.8)-(V5*$I5*'Input sheet '!$F$32)-(V5*'Input sheet '!$F$34)","v":85.142251394046369},{"$f":"W5+'Input sheet '!$F$36+($H5*0.8)-(W5*$I5*'Input sheet '!$F$32)-(W5*'Input sheet '!$F$34)","v":81.970780830488522},{"$f":"(($Q5*$D5*'Input sheet '!$C$25*'Input sheet '!$D$25*'Input sheet '!$M$11)+($Q5*$D5*'Input sheet '!$C$26*'Input sheet '!$D$26*'Input sheet '!$M$11)+($Q5*$D5*'Input sheet '!$C$27*'Input sheet '!$D$27*'Input sheet '!$M$11))/($O5*$P5*60*(1-'Input sheet '!$F$30))","v":138.59558517552571},141.52519047435004,144.51672117430479,147.57148624192777,150.69082231242533,153.87609427452699,null,{"$f":"Q5*D5","v":1338164.2706602484},{"$f":"E5*(Q5*(1+R5)^5)","v":1486212.0140532255}]
["GP","Brent","NWL",328567.72756406281,345659.87338337739,1.0101940645966765,176.71000060439101,18,0.30569948186528495,0.17499999999999999,0.06,12.5,10,45,200,10.5,5.5,1.7000000000000001E-2,176.71000060439101,{"$f":"S6+'Input sheet '!$F$36+($H6*0.8)-(S6*$I6*'Input sheet '!$F$32)-(S6*'Input sheet '!$F$34)","v":176.05387333372167},{"$f":"T6+'Input sheet '!$F$36+($H6*0.8)-(T6*$I6*'Input sheet '!$F$32)-(T6*'Input sheet '!$F$34)","v":175.4722148084617},{"$f":"U6+'Input sheet '!$F$36+($H6*0.8)-(U6*$I6*'Input sheet '!$F$32)-(U6*'Input sheet '!$F$34)","v":174.95657301893138},{"$f":"V6+'Input sheet '!$F$36+($H6*0.8)-(V6*$I6*'Input sheet '!$F$32)-(V6*'Input sheet '!$F$34)","v":174.4994552366532},{"$f":"W6+'Input sheet '!$F$36+($H6*0.8)-(W6*$I6*'Input sheet '!$F$32)-(W6*'Input sheet '!$F$34)","v":174.09421913842064},{"$f":"(($Q6*$D6*'Input sheet '!$C$25*'Input sheet '!$D$25*'Input sheet '!$M$11)+($Q6*$D6*'Input sheet '!$C$26*'Input sheet '!$D$26*'Input sheet '!$M$11)+($Q6*$D6*'Input sheet '!$C$27*'Input sheet '!$D$27*'Input sheet '!$M$11))/($O6*$P6*60*(1-'Input sheet '!$F$30))","v":187.16625909452864},192.25607043466351,197.48429443316692,202.85469509281151,208.37113877490452,214.0375969828323,null,1807122.5016023454,2068313.757205853]
["GP","Bromley","SEL",326559.5853084338,333607.56805070851,1.0042797173545257,170.28000102564701,15,0.19444444444444442,0.17499999999999999,0.06,12.5,10,45,200,10.5,5.5,1.7000000000000001E-2,170.28000102564701,{"$f":"S7+'Input sheet '!$F$36+($H7*0.8)-(S7*$I7*'Input sheet '!$F$32)-(S7*'Input sheet '!$F$34)","v":171.26895092920768},{"$f":"T7+'Input sheet '!$F$36+($H7*0.8)-(T7*$I7*'Input sheet '!$F$32)-(T7*'Input sheet '!$F$34)","v":172.16491207100302},{"$f":"U7+'Input sheet '!$F$36+($H7*0.8)-(U7*$I7*'Input sheet '!$F$32)-(U7*'Input sheet '!$F$34)","v":172.97662797766009},{"$f":"V7+'Input sheet '!$F$36+($H7*0.8)-(V7*$I7*'Input sheet '!$F$32)-(V7*'Input sheet '!$F$34)","v":173.71202004142731},{"$f":"W7+'Input sheet '!$F$36+($H7*0.8)-(W7*$I7*'Input sheet '!$F$32)-(W7*'Input sheet '!$F$34)","v":174.37826482364312},{"$f":"(($Q7*$D7*'Input sheet '!$C$25*'Input sheet '!$D$25*'Input sheet '!$M$11)+($Q7*$D7*'Input sheet '!$C$26*'Input sheet '!$D$26*'Input sheet '!$M$11)+($Q7*$D7*'Input sheet '!$C$27*'Input sheet '!$D$27*'Input sheet '!$M$11))/($O7*$P7*60*(1-'Input sheet '!$F$30))","v":186.02233520248285},189.9808379172205,194.02357645087488,198.15234331786368,202.36896917680474,206.67532364221384,null,1796077.7191963859,1996196.7692500181]
["GP","Camden","NCL",240595.18761568028,249811.74199355792,1.0075466939171021,142.8500007689,35,0.15942028985507245,0.17499999999999999,0.06,12.5,10,45,200,10.5,5.5,1.7000000000000001E-2,142.8500007689,{"$f":"S8+'Input sheet '!$F$36+($H8*0.8)-(S8*$I8*'Input sheet '!$F$32)-(S8*'Input sheet '!$F$34)","v":163.29369273030031},{"$f":"T8+'Input sheet '!$F$36+($H8*0.8)-(T8*$I8*'Input sheet '!$F$32)-(T8*'Input sheet '!$F$34)","v":181.94041379683262},{"$f":"U8+'Input sheet '!$F$36+($H8*0.8)-(U8*$I8*'Input sheet '!$F$32)-(U8*'Input sheet '!$F$34)","v":198.94811510585018},{"$f":"V8+'Input sheet '!$F$36+($H8*0.8)-(V8*$I8*'Input sheet '!$F$32)-(V8*'Input sheet '!$F$34)","v":214.46086411864755},{"$f":"W8+'Input sheet '!$F$36+($H8*0.8)-(W8*$I8*'Input sheet '!$F$32)-(W8*'Input sheet '!$F$34)","v":228.61006497546498},{"$f":"(($Q8*$D8*'Input sheet '!$C$25*'Input sheet '!$D$25*'Input sheet '!$M$11)+($Q8*$D8*'Input sheet '!$C$26*'Input sheet '!$D$26*'Input sheet '!$M$11)+($Q8*$D8*'Input sheet '!$C$27*'Input sheet '!$D$27*'Input sheet '!$M$11))/($O8*$P8*60*(1-'Input sheet '!$F$30))","v":137.05333008821785},140.41753623221288,143.86432251469859,147.39571600505812,151.01379353052636,154.72068289758062,null,1323273.5318862414,1494790.4065907185,"STP list",null,"SEL List","SWL List","NWL List","NCL List","NEL List"]
["GP","Central London (Westminster)","NWL",239861.52740131211,250416.29464483997,1.0086497797931231,95.3600004315376,12,0.22471910112359553,0.17499999999999999,0.06,12.5,10,45,200,10.5,5.5,1.7000000000000001E-2,95.3600004315376,{"$f":"S9+'Input sheet '!$F$36+($H9*0.8)-(S9*$I9*'Input sheet '!$F$32)-(S9*'Input sheet '!$F$34)","v":100.48828802912419},{"$f":"T9+'Input sheet '!$F$36+($H9*0.8)-(T9*$I9*'Input sheet '!$F$32)-(T9*'Input sheet '!$F$34)","v":105.10720413948984},{"$f":"U9+'Input sheet '!$F$36+($H9*0.8)-(U9*$I9*'Input sheet '!$F$32)-(U9*'Input sheet '!$F$34)","v":109.26734251484838},{"$f":"V9+'Input sheet '!$F$36+($H9*0.8)-(V9*$I9*'Input sheet '!$F$32)-(V9*'Input sheet '!$F$34)","v":113.01427164033986},{"$f":"W9+'Input sheet '!$F$36+($H9*0.8)-(W9*$I9*'Input sheet '!$F$32)-(W9*'Input sheet '!$F$34)","v":116.38903387291735},{"$f":"(($Q9*$D9*'Input sheet '!$C$25*'Input sheet '!$D$25*'Input sheet '!$M$11)+($Q9*$D9*'Input sheet '!$C$26*'Input sheet '!$D$26*'Input sheet '!$M$11)+($Q9*$D9*'Input sheet '!$C$27*'Input sheet '!$D$27*'Input sheet '!$M$11))/($O9*$P9*60*(1-'Input sheet '!$F$30))","v":136.63540578753313},140.14007385792735,143.73463589257517,147.42139765186442,151.20272403842915,155.08104061413522,null,1319238.4007072167,1498407.8486541051,"SEL",null,"All","All","All","All","All"]
["GP","City & Hackney","NEL",279460,298024,1.0129460539573998,167.43000060319901,12,0.17177914110429449,0.17499999999999999,0.06,12.5,10,45,200,10.5,5.5,1.7000000000000001E-2,167.43000060319901,{"$f":"S10+'Input sheet '!$F$36+($H10*0.8)-(S10*$I10*'Input sheet '!$F$32)-(S10*'Input sheet '!$F$34)","v":166.95102876973297},{"$f":"T10+'Input sheet '!$F$36+($H10*0.8)-(T10*$I10*'Input sheet '!$F$32)-(T10*'Input sheet '!$F$34)","v":166.51519378605394},{"$f":"U10+'Input sheet '!$F$36+($H10*0.8)-(U10*$I10*'Input sheet '!$F$32)-(U10*'Input sheet '!$F$34)","v":166.11861068924858},{"$f":"V10+'Input sheet '!$F$36+($H10*0.8)-(V10*$I10*'Input sheet '!$F$32)-(V10*'Input sheet '!$F$34)","v":165.75774440140705},{"$f":"W10+'Input sheet '!$F$36+($H10*0.8)-(W10*$I10*'Input sheet '!$F$32)-(W10*'Input sheet '!$F$34)","v":165.42937821850731},{"$f":"(($Q10*$D10*'Input sheet '!$C$25*'Input sheet '!$D$25*'Input sheet '!$M$11)+($Q10*$D10*'Input sheet '!$C$26*'Input sheet '!$D$26*'Input sheet '!$M$11)+($Q10*$D10*'Input sheet '!$C$27*'Input sheet '!$D$27*'Input sheet '!$M$11))/($O10*$P10*60*(1-'Input sheet '!$F$30))","v":159.19239285714283},163.9595768432504,168.8695191782308,173.92649491130226,179.13490711253752,184.49929070658334,null,1537030,1783276.528872211,"SWL",null,"Bexley","Croydon","Brent","Barnet","Barking & Dagenham"]
["GP","Croydon","SWL",383407.61972583208,399552.08416668023,1.0082832025684092,185.77000115811799,17,0.27225130890052357,0.17499999999999999,0.06,12.5,10,45,200,10.5,5.5,1.7000000000000001E-2,185.77000115811799,{"$f":"S11+'Input sheet '!$F$36+($H11*0.8)-(S11*$I11*'Input sheet '!$F$32)-(S11*'Input sheet '!$F$34)","v":184.37297904392477},{"$f":"T11+'Input sheet '!$F$36+($H11*0.8)-(T11*$I11*'Input sheet '!$F$32)-(T11*'Input sheet '!$F$34)","v":183.12633794893475},{"$f":"U11+'Input sheet '!$F$36+($H11*0.8)-(U11*$I11*'Input sheet '!$F$32)-(U11*'Input sheet '!$F$34)","v":182.01389026186615},{"$f":"V11+'Input sheet '!$F$36+($H11*0.8)-(V11*$I11*'Input sheet '!$F$32)-(V11*'Input sheet '!$F$34)","v":181.02119087032705},{"$f":"W11+'Input sheet '!$F$36+($H11*0.8)-(W11*$I11*'Input sheet '!$F$32)-(W11*'Input sheet '!$F$34)","v":180.13534959130126},{"$f":"(($Q11*$D11*'Input sheet '!$C$25*'Input sheet '!$D$25*'Input sheet '!$M$11)+($Q11*$D11*'Input sheet '!$C$26*'Input sheet '!$D$26*'Input sheet '!$M$11)+($Q11*$D11*'Input sheet '!$C$27*'Input sheet '!$D$27*'Input sheet '!$M$11))/($O11*$P11*60*(1-'Input sheet '!$F$30))","v":218.40541195096506},223.92740022335815,229.58900204382252,235.39374728997538,241.34525508604472,247.44723605930955,null,2108741.9084920762,2390786.8284313176,"NWL",null,"Bromley","Kingston","Ealing","Camden","City & Hackney"]
["GP","Ealing","NWL",348532.50761086139,364118.82879069319,1.0087881434893804,182.78000037372101,15,0.22613065326633167,0.17499999999999999,0.06,12.5,10,45,200,10.5,5.5,1.7000000000000001E-2,182.78000037372101,{"$f":"S12+'Input sheet '!$F$36+($H12*0.8)-(S12*$I12*'Input sheet '!$F$32)-(S12*'Input sheet '!$F$34)","v":181.58007219580503},{"$f":"T12+'Input sheet '!$F$36+($H12*0.8)-(T12*$I12*'Input sheet '!$F$32)-(T12*'Input sheet '!$F$34)","v":180.49962430354435},{"$f":"U12+'Input sheet '!$F$36+($H12*0.8)-(U12*$I12*'Input sheet '!$F$32)-(U12*'Input sheet '!$F$34)","v":179.52675970266631},{"$f":"V12+'Input sheet '!$F$36+($H12*0.8)-(V12*$I12*'Input sheet '!$F$32)-(V12*'Input sheet '!$F$34)","v":178.65076601669477},{"$f":"W12+'Input sheet '!$F$36+($H12*0.8)-(W12*$I12*'Input sheet '!$F$32)-(W12*'Input sheet '!$F$34)","v":177.8619975311631},{"$f":"(($Q12*$D12*'Input sheet '!$C$25*'Input sheet '!$D$25*'Input sheet '!$M$11)+($Q12*$D12*'Input sheet '!$C$26*'Input sheet '!$D$26*'Input sheet '!$M$11)+($Q12*$D12*'Input sheet '!$C$27*'Input sheet '!$D$27*'Input sheet '!$M$11))/($O12*$P12*60*(1-'Input sheet '!$F$30))","v":198.53905344261571},203.65900704103962,208.91099473751865,214.29842144631894,219.82477988812431,225.49365285440069,null,1916928.7918597376,2178766.009123031,"NCL",null,"Greenwich","Richmond","Hounslow","Enfield","Havering"]
["GP","Enfield","NCL",330967.75695051916,341277.20653224899,1.0061536785243599,148.14000108093001,10,0.31578947368421051,0.17499999999999999,0.06,12.5,10,45,200,10.5,5.5,1.7000000000000001E-2,148.14000108093001,{"$f":"S13+'Input sheet '!$F$36+($H13*0.8)-(S13*$I13*'Input sheet '!$F$32)-(S13*'Input sheet '!$F$34)","v":144.0649167458123},{"$f":"T13+'Input sheet '!$F$36+($H13*0.8)-(T13*$I13*'Input sheet '!$F$32)-(T13*'Input sheet '!$F$34)","v":140.45953949984761},{"$f":"U13+'Input sheet '!$F$36+($H13*0.8)-(U13*$I13*'Input sheet '!$F$32)-(U13*'Input sheet '!$F$34)","v":137.26972942065464},{"$f":"V13+'Input sheet '!$F$36+($H13*0.8)-(V13*$I13*'Input sheet '!$F$32)-(V13*'Input sheet '!$F$34)","v":134.44758692427393},{"$f":"W13+'Input sheet '!$F$36+($H13*0.8)-(W13*$I13*'Input sheet '!$F$32)-(W13*'Input sheet '!$F$34)","v":131.95073348405501},{"$f":"(($Q13*$D13*'Input sheet '!$C$25*'Input sheet '!$D$25*'Input sheet '!$M$11)+($Q13*$D13*'Input sheet '!$C$26*'Input sheet '!$D$26*'Input sheet '!$M$11)+($Q13*$D13*'Input sheet '!$C$27*'Input sheet '!$D$27*'Input sheet '!$M$11))/($O13*$P13*60*(1-'Input sheet '!$F$30))","v":188.53341869145643},192.89866085893695,197.36497444024428,201.93469961040219,206.61023072809459,211.39401759021669,null,1820322.6632278555,2042089.3359193676,"NEL",null,"Lambeth","Merton","Hammersmith & Fulham","Haringey","Newham"]
["GP","Greenwich","SEL",275868.4929970568,300643.75647960498,1.0173491284187914,132.21000069379801,21,0.328125,0.17499999999999999,0.06,12.5,10,45,200,10.5,5.5,1.7000000000000001E-2,132.21000069379801,{"$f":"S14+'Input sheet '!$F$36+($H14*0.8)-(S14*$I14*'Input sheet '!$F$32)-(S14*'Input sheet '!$F$34)","v":138.48565451858096},{"$f":"T14+'Input sheet '!$F$36+($H14*0.8)-(T14*$I14*'Input sheet '!$F$32)-(T14*'Input sheet '!$F$34)","v":144.02440930440699},{"$f":"U14+'Input sheet '!$F$36+($H14*0.8)-(U14*$I14*'Input sheet '!$F$32)-(U14*'Input sheet '!$F$34)","v":148.91279311811607},{"$f":"V14+'Input sheet '!$F$36+($H14*0.8)-(V14*$I14*'Input sheet '!$F$32)-(V14*'Input sheet '!$F$34)","v":153.2271737386998},{"$f":"W14+'Input sheet '!$F$36+($H14*0.8)-(W14*$I14*'Input sheet '!$F$32)-(W14*'Input sheet '!$F$34)","v":157.03495169735092},{"$f":"(($Q14*$D14*'Input sheet '!$C$25*'Input sheet '!$D$25*'Input sheet '!$M$11)+($Q14*$D14*'Input sheet '!$C$26*'Input sheet '!$D$26*'Input sheet '!$M$11)+($Q14*$D14*'Input sheet '!$C$27*'Input sheet '!$D$27*'Input sheet '!$M$11))/($O14*$P14*60*(1-'Input sheet '!$F$30))","v":157.1465165465377},162.54436242396045,168.12761960261162,173.90265679908742,179.87606148984827,186.05464742542947,null,1517276.7114838124,1798952.2806285811,null,null,"Lewisham","Sutton","Harrow","Islington","Redbridge"]
["GP","Hammersmith & Fulham","NWL",183353.76720927597,192209.96511626421,1.0094788225525733,100.540000244975,11,0.18292682926829268,0.17499999999999999,0.06,12.5,10,45,200,10.5,5.5,1.7000000000000001E-2,100.540000244975,{"$f":"S15+'Input sheet '!$F$36+($H15*0.8)-(S15*$I15*'Input sheet '!$F$32)-(S15*'Input sheet '!$F$34)","v":105.08909412487334},{"$f":"T15+'Input sheet '!$F$36+($H15*0.8)-(T15*$I15*'Input sheet '!$F$32)-(T15*'Input sheet '!$F$34)","v":109.2196158910664},{"$f":"U15+'Input sheet '!$F$36+($H15*0.8)-(U15*$I15*'Input sheet '!$F$32)-(U15*'Input sheet '!$F$34)","v":112.97007928255303},{"$f":"V15+'Input sheet '!$F$36+($H15*0.8)-(V15*$I15*'Input sheet '!$F$32)-(V15*'Input sheet '!$F$34)","v":116.37545430466446},{"$f":"W15+'Input sheet '!$F$36+($H15*0.8)-(W15*$I15*'Input sheet '!$F$32)-(W15*'Input sheet '!$F$34)","v":119.46749329577796},{"$f":"(($Q15*$D15*'Input sheet '!$C$25*'Input sheet '!$D$25*'Input sheet '!$M$11)+($Q15*$D15*'Input sheet '!$C$26*'Input sheet '!$D$26*'Input sheet '!$M$11)+($Q15*$D15*'Input sheet '!$C$27*'Input sheet '!$D$27*'Input sheet '!$M$11))/($O15*$P15*60*(1-'Input sheet '!$F$30))","v":104.44616382099828},107.21177525911148,110.05061683174384,112.9646275866328,115.95579791521676,119.02617091215582,null,1008445.7196510178,1150120.5252166952,null,null,"Southwark","Wandsworth","Hillingdon",null,"Tower Hamlets"]
{"$rows_left_out":94}